Target
Neuropeptide Y receptor type 2
Ligand
BDBM42432
Substrate
Meas. Tech.
Dose response counterscreen assay for neuropeptide Y receptor Y1 (NPY-Y1): Cell-based high throughput assay to measure NPY-Y2 antagonism
IC50
>35000±n/a nM
Citation
 PubChem, PC Dose response counterscreen assay for neuropeptide Y receptor Y1 (NPY-Y1): Cell-based high throughput assay to measure NPY-Y2 antagonism PubChem Bioassay (2008)[AID] 
Target
Name:
Neuropeptide Y receptor type 2
Synonyms:
NPY-Y2 NPY2-R NPY2R_HUMAN Y2 receptor | neuropeptide Y receptor Y2
Type:
Enzyme Catalytic Domain
Mol. Mass.:
42734.65
Organism:
Homo sapiens (Human)
Description:
NPY-Y2 NPY2R HUMAN::P49146
Residue:
381
  
Inhibitor
Name:
BDBM42432
Synonyms:
MLS000585997 N-(2,6-diethylphenyl)-2-phenyl-2-(thiophen-2-ylsulfonylamino)acetamide N-(2,6-diethylphenyl)-2-phenyl-2-[(thien-2-ylsulfonyl)amino]acetamide cid_12005500
Type:
Small organic molecule
Emp. Form.:
C22H24N2O3S2
Mol. Mass.:
428.568
SMILES:
CCc1cccc(CC)c1NC(=O)C(NS(=O)(=O)c1cccs1)c1ccccc1
: