Target
Neuropeptide Y receptor type 2
Ligand
BDBM42450
Substrate
Meas. Tech.
Dose response counterscreen assay for neuropeptide Y receptor Y1 (NPY-Y1): Cell-based high throughput assay to measure NPY-Y2 antagonism
IC50
>35000±n/a nM
Citation
 PubChem, PC Dose response counterscreen assay for neuropeptide Y receptor Y1 (NPY-Y1): Cell-based high throughput assay to measure NPY-Y2 antagonism PubChem Bioassay (2008)[AID] 
Target
Name:
Neuropeptide Y receptor type 2
Synonyms:
NPY-Y2 NPY2-R NPY2R_HUMAN Y2 receptor | neuropeptide Y receptor Y2
Type:
Enzyme Catalytic Domain
Mol. Mass.:
42734.65
Organism:
Homo sapiens (Human)
Description:
NPY-Y2 NPY2R HUMAN::P49146
Residue:
381
  
Inhibitor
Name:
BDBM42450
Synonyms:
(4E)-4-[4-(1,3-benzothiazol-2-yl)-1,2-dihydropyrazol-3-ylidene]-3-hydroxy-1-cyclohexa-2,5-dienone (4E)-4-[4-(1,3-benzothiazol-2-yl)-1,2-dihydropyrazol-3-ylidene]-3-oxidanyl-cyclohexa-2,5-dien-1-one MLS000680157 US8754233, 4-(4-Benzothiazol-2-yl-1H-pyrazol-3-yl)-benzene-1,3-diol | cid_6710438
Type:
Small organic molecule
Emp. Form.:
C16H11N3O2S
Mol. Mass.:
309.342
SMILES:
Oc1ccc(-c2n[nH]cc2-c2nc3ccccc3s2)c(O)c1
: