Target
Neuropeptide Y receptor type 2
Ligand
BDBM42456
Substrate
Meas. Tech.
Dose response counterscreen assay for neuropeptide Y receptor Y1 (NPY-Y1): Cell-based high throughput assay to measure NPY-Y2 antagonism
IC50
5902±n/a nM
Citation
 PubChem, PC Dose response counterscreen assay for neuropeptide Y receptor Y1 (NPY-Y1): Cell-based high throughput assay to measure NPY-Y2 antagonism PubChem Bioassay (2008)[AID] 
Target
Name:
Neuropeptide Y receptor type 2
Synonyms:
NPY-Y2 NPY2-R NPY2R_HUMAN Y2 receptor | neuropeptide Y receptor Y2
Type:
Enzyme Catalytic Domain
Mol. Mass.:
42734.65
Organism:
Homo sapiens (Human)
Description:
NPY-Y2 NPY2R HUMAN::P49146
Residue:
381
  
Inhibitor
Name:
BDBM42456
Synonyms:
3-(2,4-dimethylphenyl)-2-phenyl-4,5-dihydroimidazo[1,2-a]quinolin-10-ium;bromide SMR000352439 | cid_16196151
Type:
Small organic molecule
Emp. Form.:
C25H23N2
Mol. Mass.:
351.463
SMILES:
Cc1ccc(c(C)c1)-n1c(c[n+]-2c1CCc1ccccc-21)-c1ccccc1
: