Target
Heat shock cognate 71 kDa protein
Ligand
BDBM50192459
Substrate
Meas. Tech.
In Vitro Hsc70 Dose Response Fluorescence Polarization Assay
IC50
17300±7510 nM
Citation
 PubChem, PC In Vitro Hsc70 Dose Response Fluorescence Polarization Assay PubChem Bioassay (2008)[AID] 
Target
Name:
Heat shock cognate 71 kDa protein
Synonyms:
HSC70 HSP7C_HUMAN HSPA8 heat shock 70kDa protein 8 isoform 2
Type:
Enzyme Catalytic Domain
Mol. Mass.:
70887.67
Organism:
Homo sapiens (Human)
Description:
gi_5729877
Residue:
646
  
Inhibitor
Name:
BDBM50192459
Synonyms:
ATP(4-) atp | cid_16654697
Type:
Small organic molecule
Emp. Form.:
C10H12N5O13P3
Mol. Mass.:
503.1515
SMILES:
Nc1ncnc2n(cnc12)[C@@H]1O[C@H](COP([O-])(=O)OP([O-])(=O)OP([O-])([O-])=O)[C@@H](O)[C@H]1O
: