Target
Zinc finger protein mex-5
Ligand
BDBM52083
Substrate
Meas. Tech.
Fluorescent Polarization Homogeneous Dose Response HTS to Indentify Inhibitors of Mex-5 Binding to TCR-2
EC50
125376±n/a nM
Citation
 PubChem, PC Fluorescent Polarization Homogeneous Dose Response HTS to Indentify Inhibitors of Mex-5 Binding to TCR-2 PubChem Bioassay (2009)[AID] 
Target
Name:
Zinc finger protein mex-5
Synonyms:
MEX5_CAEEL mex-5
Type:
Enzyme Catalytic Domain
Mol. Mass.:
52832.78
Organism:
Caenorhabditis elegans
Description:
gi_55976631
Residue:
468
  
Inhibitor
Name:
BDBM52083
Synonyms:
4-(1-HYDROXY-2-[(1-METHYLETHYL)AMINO]BUTYL)-1,2-BENZENEDIOL METHANESULFONATE SALT 4-[1-hydroxy-2-(propan-2-ylamino)butyl]benzene-1,2-diol;methanesulfonic acid MLS000069674 cid_23702 | methanesulfonic acid;4-[1-oxidanyl-2-(propan-2-ylamino)butyl]benzene-1,2-diol
Type:
Small organic molecule
Emp. Form.:
C13H21NO3
Mol. Mass.:
239.3107
SMILES:
CCC(NC(C)C)C(O)c1ccc(O)c(O)c1
: