Target
Peptidyl-prolyl cis-trans isomerase ESS1
Ligand
BDBM16415
Substrate
Meas. Tech.
Pin1 Inhibition Assay
pH
7±0
Temperature
273.15±n/a K
IC50
>1.0e+4±n/a nM
Citation
 Uchida, TTakamiya, MTakahashi, MMiyashita, HIkeda, HTerada, TMatsuo, YShirouzu, MYokoyama, SFujimori, FHunter, T Pin1 and Par14 peptidyl prolyl isomerase inhibitors block cell proliferation. Chem Biol 10:15-24 (2003)  
Target
Name:
Peptidyl-prolyl cis-trans isomerase ESS1
Synonyms:
ESS1 PIN1 Parvulin ESS1 | Peptidyl-prolyl cis-trans isomerase
Type:
Protein
Mol. Mass.:
19411.52
Organism:
Saccharomyces cerevisiae (Baker's yeast)
Description:
P22696
Residue:
170
  
Inhibitor
Name:
BDBM16415
Synonyms:
(1,3-dioxo-1H-benzo[de]isoquinolin-2(3H)-yl)acetic acid Alrestatin PiG Tocris-0485
Type:
Small organic molecule
Emp. Form.:
C14H9NO4
Mol. Mass.:
255.2256
SMILES:
OC(=O)CN1C(=O)c2cccc3cccc(C1=O)c23
: