Target
Ras-related C3 botulinum toxin substrate 1
Ligand
BDBM54705
Substrate
Meas. Tech.
Additional SAR compounds tested via Multiplex dose response to identify specific small molecule inhibitors of Ras and Ras-related GTPases specifically Rac1 wildtype
EC50
30000±n/a nM
Citation
 PubChem, PC Additional SAR compounds tested via Multiplex dose response to identify specific small molecule inhibitors of Ras and Ras-related GTPases specifically Rac1 wildtype PubChem Bioassay (2009)[AID] 
Target
Name:
Ras-related C3 botulinum toxin substrate 1
Synonyms:
RAC1_MOUSE Rac1 protein
Type:
PROTEIN
Mol. Mass.:
21455.91
Organism:
Mus musculus
Description:
EBI_101485
Residue:
192
  
Inhibitor
Name:
BDBM54705
Synonyms:
CHEMBL1297 UNM-0000306101 calcium;2-(3-phenoxyphenyl)propionic acid;hydrate | cid_16219353
Type:
Small organic molecule
Emp. Form.:
C15H14O3
Mol. Mass.:
242.2699
SMILES:
CC(C(O)=O)c1cccc(Oc2ccccc2)c1
: