Target
Protein-glutamine gamma-glutamyltransferase 2
Ligand
BDBM59189
Substrate
Meas. Tech.
TG Inhibition Assay
pH
7.2±0
Ki
87000±0.0 nM
Citation
 Choi, KSiegel, MPiper, JLYuan, LCho, EStrnad, POmary, BRich, KMKhosla, C Chemistry and biology of dihydroisoxazole derivatives: selective inhibitors of human transglutaminase 2. Chem Biol 12:469-75 (2005)  
Target
Name:
Protein-glutamine gamma-glutamyltransferase 2
Synonyms:
Protein-glutamine gamma-glutamyltransferase TGM2 Tissue transglutaminase Transglutaminase 2 (TGM2) Transglutaminase-2
Type:
Protein
Mol. Mass.:
77309.30
Organism:
Homo sapiens (Human)
Description:
P21980
Residue:
687
  
Inhibitor
Name:
BDBM59189
Synonyms:
Dihydroisoxazole, 3f
Type:
Small organic molecule
Emp. Form.:
C23H22BrN3O6S
Mol. Mass.:
548.406
SMILES:
BrC1=NOC(CNC(=O)[C@H](Cc2ccccc2)NC(=O)OCC2=Cc3ccccc3S2(=O)=O)C1
: