Target
Cyclin-dependent kinase 5
Ligand
BDBM59197
Substrate
Meas. Tech.
In Vitro Kinase Assay of Tau Phosphorylation
IC50
6.6e+4±n/a nM
Citation
 Ahn, JSRadhakrishnan, MLMapelli, MChoi, STidor, BCuny, GDMusacchio, AYeh, LAKosik, KS Defining Cdk5 ligand chemical space with small molecule inhibitors of tau phosphorylation. Chem Biol 12:811-23 (2005)  
Target
Name:
Cyclin-dependent kinase 5
Synonyms:
CDK5 CDKN5 Cyclin-dependent kinase 5 (CDK5/ p25) Cyclin-dependent-like kinase 5 PSSALRE Tau protein kinase II catalytic subunit
Type:
Enzyme Subunit
Mol. Mass.:
33308.61
Organism:
Homo sapiens (Human)
Description:
Residue:
292
  
Inhibitor
Name:
BDBM59197
Synonyms:
4-aminothiazole, 2.3
Type:
Small organic molecule
Emp. Form.:
C16H11Cl2N3OS
Mol. Mass.:
364.249
SMILES:
Nc1nc(Nc2ccc(Cl)cc2)sc1C(=O)c1ccc(Cl)cc1
: