Target
Adenosine receptor A2a
Ligand
BDBM50080390
Substrate
Meas. Tech.
Binding Assay
Ki
764±105 nM
Citation
 Jacobson, KAOhno, MDuong, HTKim, SKTchilibon, SCesnek, MHolý, AGao, ZG A neoceptor approach to unraveling microscopic interactions between the human A2A adenosine receptor and its agonists. Chem Biol 12:237-47 (2005)  
Target
Name:
Adenosine receptor A2a
Synonyms:
A2A adenosine receptor (hA2A) ADENOSINE A2 ADORA2 Adenosine A2A receptor (A2AAR)
Type:
G Protein-Coupled Receptor (GPCR)
Mol. Mass.:
44716.46
Organism:
Homo sapiens (Human)
Description:
P29274
Residue:
412
  
Inhibitor
Name:
BDBM50080390
Synonyms:
(2R,3R,4S,5R)-2-(6-(2-methyl-benzylamino)-9H-purin-9-yl)-5-(hydroxymethyl)-tetrahydrofuran-3,4-diol Adenosine analog, 16 Metrifudil
Type:
Small organic molecule
Emp. Form.:
C18H21N5O4
Mol. Mass.:
371.3904
SMILES:
Cc1ccccc1CNc1ncnc2n(cnc12)[C@@H]1O[C@H](CO)[C@@H](O)[C@H]1O
: