Target
Adenosine receptor A3
Ligand
BDBM59211
Substrate
Meas. Tech.
Binding Assay
Ki
719±37 nM
Citation
 Jacobson, KAOhno, MDuong, HTKim, SKTchilibon, SCesnek, MHolý, AGao, ZG A neoceptor approach to unraveling microscopic interactions between the human A2A adenosine receptor and its agonists. Chem Biol 12:237-47 (2005)  
Target
Name:
Adenosine receptor A3
Synonyms:
A3 adenosine receptor (hA3) ADORA3 | Adenosine A3 receptor (A3AR)
Type:
G Protein-Coupled Receptor (GPCR)
Mol. Mass.:
36197.32
Organism:
Homo sapiens (Human)
Description:
P0DMS8
Residue:
318
  
Inhibitor
Name:
BDBM59211
Synonyms:
Adenosine analog, 18
Type:
Small organic molecule
Emp. Form.:
C12H18N6O4
Mol. Mass.:
310.3091
SMILES:
CNc1nc(CN)nc2n(cnc12)[C@@H]1O[C@H](CO)[C@@H](O)[C@H]1O
: