Target
Gag-Pol polyprotein [588-1027,K690N]/[588-1147,K690N]
Ligand
BDBM1434
Substrate
(poly)rC:(oligo)dG
Meas. Tech.
HIV-1 RT Assay
pH
8.2±n/a
IC50
57900±n/a nM
Citation
 Williams, TMCiccarone, TMMacTough, SCRooney, CSBalani, SKCondra, JHEmini, EAGoldman, MEGreenlee, WJKauffman, LR 5-chloro-3-(phenylsulfonyl)indole-2-carboxamide: a novel, non-nucleoside inhibitor of HIV-1 reverse transcriptase. J Med Chem 36:1291-4 (1993)  
Target
Name:
Gag-Pol polyprotein [588-1027,K690N]/[588-1147,K690N]
Synonyms:
EC: 2.7.7.49 | HIV-1 Reverse Transcriptase Mutant (K103N)
Type:
Protein Complex
Mol. Mass.:
Description:
Components:
This complex has 2 components.
Component 1
Name:
Gag-Pol polyprotein [588-1147,K690N]
Synonyms:
HIV-1 Reverse Transcriptase Mutant (K103N) Chain A gag-pol
Type:
Enzyme Subunit
Mol. Mass.:
64471.33
Organism:
Human immunodeficiency virus type 1
Description:
P04585[588-1147,K690N]
Residue:
560
  
Component 2
Name:
Gag-Pol polyprotein [588-1027,K690N]
Synonyms:
HIV-1 Reverse Transcriptase Mutant (K103N) Chain B gag-pol
Type:
Enzyme Subunit
Mol. Mass.:
51280.01
Organism:
Human immunodeficiency virus type 1
Description:
P04585[588-1027,K690N]
Residue:
440
  
Inhibitor
Name:
BDBM1434
Synonyms:
11-cyclopropyl-5,11-dihydro-4-methyl-6H-dipyrido[3,2-b:2 ,3 -e][1,4]diazepin-6-one BI-RG-587 Nevirapine US11420959, Example NVP | Viramune
Type:
Small organic molecule
Emp. Form.:
C15H14N4O
Mol. Mass.:
266.2979
SMILES:
Cc1ccnc2N(C3CC3)c3ncccc3C(=O)Nc12
:
Substrate
Name:
(poly)rC:(oligo)dG
Synonyms:
Type:
RNA-DNA duplex
Mol. Mass.:
358.43
Organism:
Description:
The incorporation of Tritium-labeled [3H]dGTP onto a (poly)rC:(oligo)dG template:primer.
Residue:
3
NA