Target
Heat shock factor protein 1
Ligand
BDBM54356
Substrate
Meas. Tech.
Luminescence Cell-Based Dose Confimation HTS to Identify Inhibitors of Heat Shock Factor 1 (HSF1)
EC50
<160±0 nM
Citation
 PubChem, PC Luminescence Cell-Based Dose Confimation HTS to Identify Inhibitors of Heat Shock Factor 1 (HSF1) PubChem Bioassay (2010)[AID] 
Target
Name:
Heat shock factor protein 1
Synonyms:
HSF1_MOUSE Hsf1 protein
Type:
Enzyme Catalytic Domain
Mol. Mass.:
57208.68
Organism:
Mus musculus
Description:
P38532
Residue:
525
  
Inhibitor
Name:
BDBM54356
Synonyms:
2-bromobenzoic acid [2-[2,5-dimethyl-1-(2-oxolanylmethyl)-3-pyrrolyl]-2-oxoethyl] ester MLS001033592 [2-[2,5-dimethyl-1-(oxolan-2-ylmethyl)pyrrol-3-yl]-2-oxidanylidene-ethyl] 2-bromanylbenzoate cid_5057111
Type:
Small organic molecule
Emp. Form.:
C20H22BrNO4
Mol. Mass.:
420.297
SMILES:
Cc1cc(C(=O)COC(=O)c2ccccc2Br)c(C)n1CC1CCCO1
: