Target
Heat shock factor protein 1
Ligand
BDBM54380
Substrate
Meas. Tech.
Luminescence Cell-Based Dose Confimation HTS to Identify Inhibitors of Heat Shock Factor 1 (HSF1)
EC50
<160±0 nM
Citation
 PubChem, PC Luminescence Cell-Based Dose Confimation HTS to Identify Inhibitors of Heat Shock Factor 1 (HSF1) PubChem Bioassay (2010)[AID] 
Target
Name:
Heat shock factor protein 1
Synonyms:
HSF1_MOUSE Hsf1 protein
Type:
Enzyme Catalytic Domain
Mol. Mass.:
57208.68
Organism:
Mus musculus
Description:
P38532
Residue:
525
  
Inhibitor
Name:
BDBM54380
Synonyms:
2-(4-propan-2-ylphenyl)-1,3-benzothiazole MLS000737657 cid_233874
Type:
Small organic molecule
Emp. Form.:
C16H15NS
Mol. Mass.:
253.362
SMILES:
CC(C)c1ccc(cc1)-c1nc2ccccc2s1
: