Target
Heat shock factor protein 1
Ligand
BDBM63826
Substrate
Meas. Tech.
Luminescence Cell-Based Dose Confimation HTS to Identify Inhibitors of Heat Shock Factor 1 (HSF1)
EC50
<160±0 nM
Citation
 PubChem, PC Luminescence Cell-Based Dose Confimation HTS to Identify Inhibitors of Heat Shock Factor 1 (HSF1) PubChem Bioassay (2010)[AID] 
Target
Name:
Heat shock factor protein 1
Synonyms:
HSF1_MOUSE Hsf1 protein
Type:
Enzyme Catalytic Domain
Mol. Mass.:
57208.68
Organism:
Mus musculus
Description:
P38532
Residue:
525
  
Inhibitor
Name:
BDBM63826
Synonyms:
1,3-benzothiazol-2-yl-(2-pyridylmethyleneamino)amine N-(2-pyridinylmethylideneamino)-1,3-benzothiazol-2-amine N-Benzothiazol-2-yl-N'-[1-pyridin-2-yl-meth-(E)-ylidene]-hydrazine cid_2857031
Type:
Small organic molecule
Emp. Form.:
C13H10N4S
Mol. Mass.:
254.31
SMILES:
C(N=Nc1nc2ccccc2s1)c1ccccn1
: