Target
Heat shock factor protein 1
Ligand
BDBM64157
Substrate
Meas. Tech.
Luminescence Cell-Based Dose Confimation HTS to Identify Inhibitors of Heat Shock Factor 1 (HSF1)
EC50
<160±0 nM
Citation
 PubChem, PC Luminescence Cell-Based Dose Confimation HTS to Identify Inhibitors of Heat Shock Factor 1 (HSF1) PubChem Bioassay (2010)[AID] 
Target
Name:
Heat shock factor protein 1
Synonyms:
HSF1_MOUSE Hsf1 protein
Type:
Enzyme Catalytic Domain
Mol. Mass.:
57208.68
Organism:
Mus musculus
Description:
P38532
Residue:
525
  
Inhibitor
Name:
BDBM64157
Synonyms:
MLS001175788 N-(2-phenylethyl)-3,4-dihydro-2H-1,5-benzodioxepine-7-carboxamide SMR000592320 | cid_9116001
Type:
Small organic molecule
Emp. Form.:
C18H19NO3
Mol. Mass.:
297.3484
SMILES:
O=C(NCCc1ccccc1)c1ccc2OCCCOc2c1
: