Target
Bcl-2-like protein 11
Ligand
BDBM25762
Substrate
Meas. Tech.
Luminescence Cell-Based Dose Retest to Identify Inhibitors of A1 Apoptosis
EC50
>350000±n/a nM
Citation
 PubChem, PC Luminescence Cell-Based Dose Retest to Identify Inhibitors of A1 Apoptosis PubChem Bioassay (2010)[AID] 
Target
Name:
Bcl-2-like protein 11
Synonyms:
B2L11_HUMAN BCL2L11 | BIM
Type:
PROTEIN
Mol. Mass.:
22175.26
Organism:
Homo sapiens (Human)
Description:
EBI_101325
Residue:
198
  
Inhibitor
Name:
BDBM25762
Synonyms:
CHEMBL471 SOTALOL HYDROCHLORIDE Sotalol,(+) cid_66245
Type:
Small organic molecule
Emp. Form.:
C12H20N2O3S
Mol. Mass.:
272.364
SMILES:
CC(C)NCC(O)c1ccc(NS(C)(=O)=O)cc1
: