Target
Apelin receptor
Ligand
BDBM67344
Substrate
Meas. Tech.
Dose Response confirmation of uHTS hits from a small molecule antagonists of the APJ receptor via a luminescent beta-arrestin assay
IC50
2048±n/a nM
Citation
 PubChem, PC Dose Response confirmation of uHTS hits from a small molecule antagonists of the APJ receptor via a luminescent beta-arrestin assay PubChem Bioassay (2010)[AID] 
Target
Name:
Apelin receptor
Synonyms:
AGTRL1 APJ_HUMAN Angiotensin receptor-like 1 Apelin receptor (APJ) G-protein coupled receptor HG11
Type:
Enzyme Catalytic Domain
Mol. Mass.:
42664.06
Organism:
Homo sapiens (Human)
Description:
P35414
Residue:
380
  
Inhibitor
Name:
BDBM67344
Synonyms:
1-(4-chlorophenyl)-2-(2-methoxyanilino)ethanone 1-(4-chlorophenyl)-2-[(2-methoxyphenyl)amino]ethanone SMR000588910 | cid_2360979
Type:
Small organic molecule
Emp. Form.:
C15H14ClNO2
Mol. Mass.:
275.73
SMILES:
COc1ccccc1NCC(=O)c1ccc(Cl)cc1
: