Target
Reverse transcriptase/RNaseH
Ligand
BDBM2337
Substrate
Meas. Tech.
HIV-1 RT Assay
IC50
40±n/a nM
Citation
 Ragno, RMai, ASbardella, GArtico, MMassa, SMusiu, CMura, MMarturana, FCadeddu, ALa Colla, P Computer-aided design, synthesis, and anti-HIV-1 activity in vitro of 2-alkylamino-6-[1-(2,6-difluorophenyl)alkyl]-3,4-dihydro-5-alkylpyrimidin-4(3H)-ones as novel potent non-nucleoside reverse transcriptase inhibitors, also active against the Y181C variant. J Med Chem 47:928-34 (2004)  
Target
Name:
Reverse transcriptase/RNaseH
Synonyms:
HIV-1 Reverse Transcriptase RNase H Reverse transcriptase/RNaseH
Type:
PROTEIN
Mol. Mass.:
65229.15
Organism:
Human immunodeficiency virus 1
Description:
ChEMBL_1473730
Residue:
566
  
Inhibitor
Name:
BDBM2337
Synonyms:
6-benzyl-1-(ethoxymethyl)-5-(propan-2-yl)-1,2,3,4-tetrahydropyrimidine-2,4-dione Coactinon Emivirine (EMV) I-EBU | MKC-442
Type:
Small organic molecule
Emp. Form.:
C17H22N2O3
Mol. Mass.:
302.3682
SMILES:
CCOCn1c(Cc2ccccc2)c(C(C)C)c(=O)[nH]c1=O
: