Target
Protein RecA
Ligand
BDBM70293
Substrate
Meas. Tech.
Fluorescence Cell-Free Homogeneous Counter Screen to Identify Inhibitors of GFP Chromophore Formation
EC50
>380000±n/a nM
Citation
 PubChem, PC Fluorescence Cell-Free Homogeneous Counter Screen to Identify Inhibitors of GFP Chromophore Formation PubChem Bioassay (2010)[AID] 
Target
Name:
Protein RecA
Synonyms:
DNA recombination protein RecA recA
Type:
Enzyme Catalytic Domain
Mol. Mass.:
85386.52
Organism:
Mycobacterium tuberculosis H37Rv
Description:
gi_15609874
Residue:
790
  
Inhibitor
Name:
BDBM70293
Synonyms:
17-alpha-hydroxy-progesterone caproate MLS000028438 cid_169870
Type:
Small organic molecule
Emp. Form.:
C27H40O4
Mol. Mass.:
428.6041
SMILES:
CCCCCC(=O)O[C@@]1(CC[C@H]2[C@@H]3CCC4=CC(=O)CC[C@]4(C)[C@H]3CC[C@]12C)C(C)=O
: