Target
Protein RecA
Ligand
BDBM70295
Substrate
Meas. Tech.
Fluorescence Cell-Free Homogeneous Dose Retest to Identify Inhibitors of RecA-Intein Splicing Activity
EC50
10300±n/a nM
Citation
 PubChem, PC Fluorescence Cell-Free Homogeneous Dose Retest to Identify Inhibitors of RecA-Intein Splicing Activity PubChem Bioassay (2010)[AID] 
Target
Name:
Protein RecA
Synonyms:
DNA recombination protein RecA recA
Type:
Enzyme Catalytic Domain
Mol. Mass.:
85386.52
Organism:
Mycobacterium tuberculosis H37Rv
Description:
gi_15609874
Residue:
790
  
Inhibitor
Name:
BDBM70295
Synonyms:
2,2-DICHLORO-N-[4-HYDROXYPHENYL]-N-METHYLACETAMIDE 2-FUROIC ACID ESTER MLS000028653 [4-[(2,2-dichloroacetyl)-methylamino]phenyl] furan-2-carboxylate cid_19529 furan-2-carboxylic acid [4-[(2,2-dichloroacetyl)-methyl-amino]phenyl] ester
Type:
Small organic molecule
Emp. Form.:
C14H11Cl2NO4
Mol. Mass.:
328.147
SMILES:
CN(C(=O)C(Cl)Cl)c1ccc(OC(=O)c2ccco2)cc1
: