Target
NACHT, LRR and PYD domains-containing protein 3
Ligand
BDBM56860
Substrate
Meas. Tech.
Dose Response confirmation of uHTS for the identification of inhibitors of NALP3 in yeast using a luminescent assay
IC50
9170±n/a nM
Citation
 PubChem, PC Dose Response confirmation of uHTS for the identification of inhibitors of NALP3 in yeast using a luminescent assay PubChem Bioassay (2010)[AID] 
Target
Name:
NACHT, LRR and PYD domains-containing protein 3
Synonyms:
C1orf7 NALP3 NLRP3 protein PYPAF1
Type:
Enzyme Catalytic Domain
Mol. Mass.:
118173.88
Organism:
Homo sapiens (Human)
Description:
Q96P20
Residue:
1036
  
Inhibitor
Name:
BDBM56860
Synonyms:
2-(2-chlorophenyl)-5-hydroxy-6-nitro-1-benzopyran-4-one 2-(2-chlorophenyl)-5-hydroxy-6-nitrochromen-4-one MLS000518333 cid_5314968
Type:
Small organic molecule
Emp. Form.:
C15H8ClNO5
Mol. Mass.:
317.681
SMILES:
Oc1c(ccc2oc(cc(=O)c12)-c1ccccc1Cl)[N+]([O-])=O
: