Target
NACHT, LRR and PYD domains-containing protein 3
Ligand
BDBM64695
Substrate
Meas. Tech.
Dose Response confirmation of uHTS for the identification of inhibitors of NALP3 in yeast using a luminescent assay
IC50
4910±n/a nM
Citation
 PubChem, PC Dose Response confirmation of uHTS for the identification of inhibitors of NALP3 in yeast using a luminescent assay PubChem Bioassay (2010)[AID] 
Target
Name:
NACHT, LRR and PYD domains-containing protein 3
Synonyms:
C1orf7 NALP3 NLRP3 protein PYPAF1
Type:
Enzyme Catalytic Domain
Mol. Mass.:
118173.88
Organism:
Homo sapiens (Human)
Description:
Q96P20
Residue:
1036
  
Inhibitor
Name:
BDBM64695
Synonyms:
6-bromanyl-2-(4-nitrophenyl)-3-oxidanyl-quinazolin-4-one 6-bromo-3-hydroxy-2-(4-nitrophenyl)-4-quinazolinone MLS000695097 cid_1471105
Type:
Small organic molecule
Emp. Form.:
C14H8BrN3O4
Mol. Mass.:
362.135
SMILES:
On1c(nc2ccc(Br)cc2c1=O)-c1ccc(cc1)[N+]([O-])=O
: