Target
NACHT, LRR and PYD domains-containing protein 3
Ligand
BDBM76275
Substrate
Meas. Tech.
Dose Response confirmation of uHTS for the identification of inhibitors of NALP3 in yeast using a luminescent assay
IC50
2900±n/a nM
Citation
 PubChem, PC Dose Response confirmation of uHTS for the identification of inhibitors of NALP3 in yeast using a luminescent assay PubChem Bioassay (2010)[AID] 
Target
Name:
NACHT, LRR and PYD domains-containing protein 3
Synonyms:
C1orf7 NALP3 NLRP3 protein PYPAF1
Type:
Enzyme Catalytic Domain
Mol. Mass.:
118173.88
Organism:
Homo sapiens (Human)
Description:
Q96P20
Residue:
1036
  
Inhibitor
Name:
BDBM76275
Synonyms:
2-oxidanylidene-2-(2-oxidanylidene-1,3-dihydroindol-3-yl)-N-pentyl-ethanamide MLS001013418 SMR000353419 | cid_4418059
Type:
Small organic molecule
Emp. Form.:
C15H18N2O3
Mol. Mass.:
274.315
SMILES:
CCCCCNC(=O)C(=O)C1C(=O)Nc2ccccc12
: