Target
NACHT, LRR and PYD domains-containing protein 3
Ligand
BDBM76300
Substrate
Meas. Tech.
Dose Response confirmation of uHTS for the identification of inhibitors of NALP3 in yeast using a luminescent assay
IC50
3710±n/a nM
Citation
 PubChem, PC Dose Response confirmation of uHTS for the identification of inhibitors of NALP3 in yeast using a luminescent assay PubChem Bioassay (2010)[AID] 
Target
Name:
NACHT, LRR and PYD domains-containing protein 3
Synonyms:
C1orf7 NALP3 NLRP3 protein PYPAF1
Type:
Enzyme Catalytic Domain
Mol. Mass.:
118173.88
Organism:
Homo sapiens (Human)
Description:
Q96P20
Residue:
1036
  
Inhibitor
Name:
BDBM76300
Synonyms:
5-(4-bromobenzyl)-7-ethyl-4-[4-(2-pyridyl)piperazino]-7,8-dihydropteridin-6-one 5-[(4-bromophenyl)methyl]-7-ethyl-4-[4-(2-pyridinyl)-1-piperazinyl]-7,8-dihydropteridin-6-one SMR000814289 | cid_42601050
Type:
Small organic molecule
Emp. Form.:
C24H26BrN7O
Mol. Mass.:
508.414
SMILES:
CCC1Nc2ncnc(N3CCN(CC3)c3ccccn3)c2N(Cc2ccc(Br)cc2)C1=O
: