Target
NACHT, LRR and PYD domains-containing protein 3
Ligand
BDBM50692
Substrate
Meas. Tech.
Dose Response confirmation of inhibitors of NALP3 in yeast using a Caspase-1-ASC counter screen
IC50
3800±n/a nM
Citation
 PubChem, PC Dose Response confirmation of inhibitors of NALP3 in yeast using a Caspase-1-ASC counter screen PubChem Bioassay (2010)[AID] 
Target
Name:
NACHT, LRR and PYD domains-containing protein 3
Synonyms:
C1orf7 NALP3 NLRP3 protein PYPAF1
Type:
Enzyme Catalytic Domain
Mol. Mass.:
118173.88
Organism:
Homo sapiens (Human)
Description:
Q96P20
Residue:
1036
  
Inhibitor
Name:
BDBM50692
Synonyms:
(2Z)-2-[(2-pyridinylamino)methylidene]-1-benzothiophen-3-one (2Z)-2-[(pyridin-2-ylamino)methylidene]-1-benzothiophen-3-one MLS000806927 cid_5421165
Type:
Small organic molecule
Emp. Form.:
C14H10N2OS
Mol. Mass.:
254.307
SMILES:
Oc1c(C=Nc2ccccn2)sc2ccccc12
: