Target
NACHT, LRR and PYD domains-containing protein 3
Ligand
BDBM53481
Substrate
Meas. Tech.
Dose Response confirmation of inhibitors of NALP3 in yeast using a Caspase-1-ASC counter screen
IC50
1220±n/a nM
Citation
 PubChem, PC Dose Response confirmation of inhibitors of NALP3 in yeast using a Caspase-1-ASC counter screen PubChem Bioassay (2010)[AID] 
Target
Name:
NACHT, LRR and PYD domains-containing protein 3
Synonyms:
C1orf7 NALP3 NLRP3 protein PYPAF1
Type:
Enzyme Catalytic Domain
Mol. Mass.:
118173.88
Organism:
Homo sapiens (Human)
Description:
Q96P20
Residue:
1036
  
Inhibitor
Name:
BDBM53481
Synonyms:
1-(3-Ethylsulfanyl-[1,2,4]thiadiazol-5-yl)-3-(3-fluoro-phenyl)-urea 1-[3-(ethylthio)-1,2,4-thiadiazol-5-yl]-3-(3-fluorophenyl)urea O-acyl oxime isatin derivative, 62 cid_3765921
Type:
Small organic molecule
Emp. Form.:
C11H11FN4OS2
Mol. Mass.:
298.36
SMILES:
CCSc1nsc(NC(=O)Nc2cccc(F)c2)n1
: