Target
NACHT, LRR and PYD domains-containing protein 3
Ligand
BDBM76282
Substrate
Meas. Tech.
Dose Response confirmation of inhibitors of NALP3 in yeast using a Caspase-1-ASC counter screen
IC50
4030±n/a nM
Citation
 PubChem, PC Dose Response confirmation of inhibitors of NALP3 in yeast using a Caspase-1-ASC counter screen PubChem Bioassay (2010)[AID] 
Target
Name:
NACHT, LRR and PYD domains-containing protein 3
Synonyms:
C1orf7 NALP3 NLRP3 protein PYPAF1
Type:
Enzyme Catalytic Domain
Mol. Mass.:
118173.88
Organism:
Homo sapiens (Human)
Description:
Q96P20
Residue:
1036
  
Inhibitor
Name:
BDBM76282
Synonyms:
2-(4-Fluoro-benzoylamino)-4-phenyl-thiophene-3-carboxylic acid 2-[(4-fluorobenzoyl)amino]-4-phenylthiophene-3-carboxylic acid 2-[[(4-fluorophenyl)-oxomethyl]amino]-4-phenyl-3-thiophenecarboxylic acid SMR000517279 | cid_829695
Type:
Small organic molecule
Emp. Form.:
C18H12FNO3S
Mol. Mass.:
341.356
SMILES:
OC(=O)c1c(NC(=O)c2ccc(F)cc2)scc1-c1ccccc1
: