Target
NACHT, LRR and PYD domains-containing protein 3
Ligand
BDBM76283
Substrate
Meas. Tech.
Dose Response confirmation of inhibitors of NALP3 in yeast using a Caspase-1-ASC counter screen
IC50
4580±n/a nM
Citation
 PubChem, PC Dose Response confirmation of inhibitors of NALP3 in yeast using a Caspase-1-ASC counter screen PubChem Bioassay (2010)[AID] 
Target
Name:
NACHT, LRR and PYD domains-containing protein 3
Synonyms:
C1orf7 NALP3 NLRP3 protein PYPAF1
Type:
Enzyme Catalytic Domain
Mol. Mass.:
118173.88
Organism:
Homo sapiens (Human)
Description:
Q96P20
Residue:
1036
  
Inhibitor
Name:
BDBM76283
Synonyms:
3-(4-Amino-phenoxy)-5-phenoxy-phenylamine 3-(4-azanylphenoxy)-5-phenoxy-aniline;hydrochloride SMR000554846 cid_6456511
Type:
Small organic molecule
Emp. Form.:
C18H16N2O2
Mol. Mass.:
292.3318
SMILES:
Nc1ccc(Oc2cc(N)cc(Oc3ccccc3)c2)cc1
: