Target
Protein RecA
Ligand
BDBM41584
Substrate
Meas. Tech.
Intein inhibitors as potential Tuberculosis drugs
IC50
2160±n/a nM
Citation
 PubChem, PC Intein inhibitors as potential Tuberculosis drugs PubChem Bioassay (2010)[AID] 
Target
Name:
Protein RecA
Synonyms:
DNA recombination protein RecA recA
Type:
Enzyme Catalytic Domain
Mol. Mass.:
85386.52
Organism:
Mycobacterium tuberculosis H37Rv
Description:
gi_15609874
Residue:
790
  
Inhibitor
Name:
BDBM41584
Synonyms:
(4-decyl-1,2,3,5,6,7-hexahydrodicyclopenta[1,2-c:1',2'-g]pyridin-8-ylidene)amine;hydrobromide 4-decyl-1,2,3,5,6,7-hexahydrodicyclopenta[1,2-c:1',2'-g]pyridin-8-imine;hydrobromide SMR000122163 | cid_9549474
Type:
Small organic molecule
Emp. Form.:
C21H34N2
Mol. Mass.:
314.5081
SMILES:
CCCCCCCCCCn1c2CCCc2c(=N)c2CCCc12
: