Target
Protein RecA
Ligand
BDBM56561
Substrate
Meas. Tech.
Intein inhibitors as potential Tuberculosis drugs
IC50
1530±n/a nM
Citation
 PubChem, PC Intein inhibitors as potential Tuberculosis drugs PubChem Bioassay (2010)[AID] 
Target
Name:
Protein RecA
Synonyms:
DNA recombination protein RecA recA
Type:
Enzyme Catalytic Domain
Mol. Mass.:
85386.52
Organism:
Mycobacterium tuberculosis H37Rv
Description:
gi_15609874
Residue:
790
  
Inhibitor
Name:
BDBM56561
Synonyms:
2-Chloro-N-(5-chloro-3-methyl-1-phenyl-1H-pyrazol-4-ylmethyl)-N-(4-chloro-phenyl)-acetamide 2-chloro-N-[(5-chloro-3-methyl-1-phenyl-4-pyrazolyl)methyl]-N-(4-chlorophenyl)acetamide 2-chloro-N-[(5-chloro-3-methyl-1-phenylpyrazol-4-yl)methyl]-N-(4-chlorophenyl)acetamide SMR000176967 | cid_1124686
Type:
Small organic molecule
Emp. Form.:
C19H16Cl3N3O
Mol. Mass.:
408.709
SMILES:
Cc1nn(c(Cl)c1CN(C(=O)CCl)c1ccc(Cl)cc1)-c1ccccc1
: