Target
Protein RecA
Ligand
BDBM70763
Substrate
Meas. Tech.
Intein inhibitors as potential Tuberculosis drugs
IC50
20520±n/a nM
Citation
 PubChem, PC Intein inhibitors as potential Tuberculosis drugs PubChem Bioassay (2010)[AID] 
Target
Name:
Protein RecA
Synonyms:
DNA recombination protein RecA recA
Type:
Enzyme Catalytic Domain
Mol. Mass.:
85386.52
Organism:
Mycobacterium tuberculosis H37Rv
Description:
gi_15609874
Residue:
790
  
Inhibitor
Name:
BDBM70763
Synonyms:
2-(N-(2-chloro-1-oxoethyl)-3,4-dimethylanilino)-N-cyclohexyl-2-(3-pyridinyl)acetamide 2-(N-(2-chloroacetyl)-3,4-dimethylanilino)-N-cyclohexyl-2-pyridin-3-ylacetamide 2-[2-chloranylethanoyl-(3,4-dimethylphenyl)amino]-N-cyclohexyl-2-pyridin-3-yl-ethanamide SMR000206937 cid_4381125
Type:
Small organic molecule
Emp. Form.:
C23H28ClN3O2
Mol. Mass.:
413.94
SMILES:
Cc1ccc(cc1C)N(C(C(=O)NC1CCCCC1)c1cccnc1)C(=O)CCl
: