Target
Protein RecA
Ligand
BDBM63230
Substrate
Meas. Tech.
Intein inhibitors as potential Tuberculosis drugs
IC50
<200±n/a nM
Citation
 PubChem, PC Intein inhibitors as potential Tuberculosis drugs PubChem Bioassay (2010)[AID] 
Target
Name:
Protein RecA
Synonyms:
DNA recombination protein RecA recA
Type:
Enzyme Catalytic Domain
Mol. Mass.:
85386.52
Organism:
Mycobacterium tuberculosis H37Rv
Description:
gi_15609874
Residue:
790
  
Inhibitor
Name:
BDBM63230
Synonyms:
2-methyl-4,9-bis(oxidanylidene)-N-(pyridin-3-ylmethyl)benzo[f][1]benzofuran-3-carboxamide 2-methyl-4,9-dioxo-N-(pyridin-3-ylmethyl)benzo[f][1]benzofuran-3-carboxamide MLS000724706 cid_2142309
Type:
Small organic molecule
Emp. Form.:
C20H14N2O4
Mol. Mass.:
346.3362
SMILES:
Cc1oc2c(c1C(=O)NCc1cccnc1)C(=O)c1ccccc1C2=O
: