Target
Protein RecA
Ligand
BDBM70847
Substrate
Meas. Tech.
Intein inhibitors as potential Tuberculosis drugs
IC50
1690±n/a nM
Citation
 PubChem, PC Intein inhibitors as potential Tuberculosis drugs PubChem Bioassay (2010)[AID] 
Target
Name:
Protein RecA
Synonyms:
DNA recombination protein RecA recA
Type:
Enzyme Catalytic Domain
Mol. Mass.:
85386.52
Organism:
Mycobacterium tuberculosis H37Rv
Description:
gi_15609874
Residue:
790
  
Inhibitor
Name:
BDBM70847
Synonyms:
2-chloranyl-1-(3-phenyl-2,3-dihydro-1,4-benzoxazin-4-yl)ethanone MLS000417219 cid_3747702
Type:
Small organic molecule
Emp. Form.:
C16H14ClNO2
Mol. Mass.:
287.741
SMILES:
ClCC(=O)N1C(COc2ccccc12)c1ccccc1
: