Target
Mitochondrial import inner membrane translocase subunit TIM10
Ligand
BDBM78436
Substrate
Meas. Tech.
Dose Response confirmation of uHTS small molecule inhibitors of tim10-1 yeast via a luminescent assay
IC50
24900±n/a nM
Citation
 PubChem, PC Dose Response confirmation of uHTS small molecule inhibitors of tim10-1 yeast via a luminescent assay PubChem Bioassay (2010)[AID] 
Target
Name:
Mitochondrial import inner membrane translocase subunit TIM10
Synonyms:
MRS11 TIM10_YEAST TPA: Essential protein of the mitochondrial intermembrane space, forms a complex with Tim9p (TIM10 complex) that delivers hydrophobic proteins to the TIM22 complex for insertion into the inner ...
Type:
Enzyme Catalytic Domain
Mol. Mass.:
10303.50
Organism:
Saccharomyces cerevisiae S288c
Description:
gi_285809906
Residue:
93
  
Inhibitor
Name:
BDBM78436
Synonyms:
2-(ethylthio)-10-[3-(4-methyl-1-piperazinyl)propyl]phenothiazine;2-hydroxybutanedioic acid 2-ethylsulfanyl-10-[3-(4-methylpiperazin-1-yl)propyl]phenothiazine;2-hydroxybutanedioic acid MLS002154140 THIETHYLPERAZINE cid_3085006 | med.21724, Compound Thiethylperazine
Type:
Small organic molecule
Emp. Form.:
C22H29N3S2
Mol. Mass.:
399.616
SMILES:
CCSc1ccc2Sc3ccccc3N(CCCN3CCN(C)CC3)c2c1
: