Target
Ubiquitin-conjugating enzyme E2 N
Ligand
BDBM79022
Substrate
Meas. Tech.
Dose Response confirmation of uHTS for the identification of UBC13 Polyubiquitin Inhibitors via a TR-FRET Assay reconfirm
IC50
8199±388 nM
Citation
 PubChem, PC Dose Response confirmation of uHTS for the identification of UBC13 Polyubiquitin Inhibitors via a TR-FRET Assay reconfirm PubChem Bioassay (2011)[AID] 
Target
Name:
Ubiquitin-conjugating enzyme E2 N
Synonyms:
BLU UBE2N_HUMAN | ubiquitin-conjugating enzyme E2 N
Type:
PROTEIN
Mol. Mass.:
17137.61
Organism:
Homo sapiens (Human)
Description:
EBI_101440
Residue:
152
  
Inhibitor
Name:
BDBM79022
Synonyms:
(Z)-2-butenedioic acid;1-[[(Z)-(5-methoxy-3-indolylidene)methyl]amino]-2-pentylguanidine (Z)-but-2-enedioic acid;1-[[(Z)-(5-methoxyindol-3-ylidene)methyl]amino]-2-pentylguanidine MLS001401406 TEGASEROD MALEATE | cid_6918369
Type:
Small organic molecule
Emp. Form.:
C16H23N5O
Mol. Mass.:
301.3867
SMILES:
CCCCCN=C(N)NN=Cc1c[nH]c2ccc(OC)cc12
: