Target
X-box-binding protein 1
Ligand
BDBM57860
Substrate
Meas. Tech.
XBP1 DR counterscreen for CHOP
IC50
160±n/a nM
Citation
 PubChem, PC XBP1 DR counterscreen for CHOP PubChem Bioassay (2011)[AID] 
Target
Name:
X-box-binding protein 1
Synonyms:
TREB5 XBP1_HUMAN | XBP2
Type:
Enzyme Catalytic Domain
Mol. Mass.:
28704.14
Organism:
Homo sapiens (Human)
Description:
gi_47678753
Residue:
261
  
Inhibitor
Name:
BDBM57860
Synonyms:
(2Z)-2-[(1-ethyl-8-methyl-2-quinolin-1-iumyl)methylidene]-3-methyl-1,3-benzothiazole;iodide (2Z)-2-[(1-ethyl-8-methyl-quinolin-1-ium-2-yl)methylidene]-3-methyl-1,3-benzothiazole;iodide MLS000709676 cid_16192857
Type:
Small organic molecule
Emp. Form.:
C21H21N2S
Mol. Mass.:
333.469
SMILES:
CC[n+]1c(\C=C2/Sc3ccccc3N2C)ccc2cccc(C)c12
: