Target
X-box-binding protein 1
Ligand
BDBM33178
Substrate
Meas. Tech.
XBP1 DR counterscreen for CHOP
IC50
160±n/a nM
Citation
 PubChem, PC XBP1 DR counterscreen for CHOP PubChem Bioassay (2011)[AID] 
Target
Name:
X-box-binding protein 1
Synonyms:
TREB5 XBP1_HUMAN | XBP2
Type:
Enzyme Catalytic Domain
Mol. Mass.:
28704.14
Organism:
Homo sapiens (Human)
Description:
gi_47678753
Residue:
261
  
Inhibitor
Name:
BDBM33178
Synonyms:
(4-bromophenyl)-(4-chlorodithiazol-5-ylidene)amine N-(4-bromophenyl)-4-chloranyl-1,2,3-dithiazol-5-imine N-(4-bromophenyl)-4-chlorodithiazol-5-imine SMR000307180 | cid_715703
Type:
Small organic molecule
Emp. Form.:
C8H4BrClN2S2
Mol. Mass.:
307.618
SMILES:
Clc1nss\c1=N/c1ccc(Br)cc1
: