Target
X-box-binding protein 1
Ligand
BDBM63645
Substrate
Meas. Tech.
XBP1 DR counterscreen for CHOP
IC50
160±n/a nM
Citation
 PubChem, PC XBP1 DR counterscreen for CHOP PubChem Bioassay (2011)[AID] 
Target
Name:
X-box-binding protein 1
Synonyms:
TREB5 XBP1_HUMAN | XBP2
Type:
Enzyme Catalytic Domain
Mol. Mass.:
28704.14
Organism:
Homo sapiens (Human)
Description:
gi_47678753
Residue:
261
  
Inhibitor
Name:
BDBM63645
Synonyms:
4-[(2R)-2-[(1R,3R,5S)-3,5-dimethyl-2-oxidanylidene-cyclohexyl]-2-oxidanyl-ethyl]piperidine-2,6-dione 4-[(2R)-2-hydroxy-2-[(1R,3R,5S)-2-keto-3,5-dimethyl-cyclohexyl]ethyl]piperidine-2,6-quinone SMR000386911 | cid_6604199
Type:
Small organic molecule
Emp. Form.:
C15H23NO4
Mol. Mass.:
281.3474
SMILES:
C[C@H]1C[C@@H](C)C(=O)[C@H](C1)[C@H](O)CC1CC(=O)NC(=O)C1
: