Target
DNA damage-inducible transcript 3 protein
Ligand
BDBM41599
Substrate
Meas. Tech.
CHOP dose-response primary assay
IC50
<160±n/a nM
Citation
 PubChem, PC CHOP dose-response primary assay PubChem Bioassay (2011)[AID] 
Target
Name:
DNA damage-inducible transcript 3 protein
Synonyms:
Chop DDIT3_MOUSE Gadd153
Type:
Enzyme Catalytic Domain
Mol. Mass.:
19175.17
Organism:
Mus musculus
Description:
gi_160707929
Residue:
168
  
Inhibitor
Name:
BDBM41599
Synonyms:
(E)-[1-[4-(4-chlorobenzyl)oxyphenyl]-2,5-dimethyl-pyrrol-3-yl]methylene-(1,2,4-triazol-4-yl)amine 1-[1-[4-[(4-chlorophenyl)methoxy]phenyl]-2,5-dimethyl-pyrrol-3-yl]-N-(1,2,4-triazol-4-yl)methanimine MLS000534371 SMR000141803 cid_1282232
Type:
Small organic molecule
Emp. Form.:
C22H20ClN5O
Mol. Mass.:
405.88
SMILES:
Cc1cc(C=Nn2cnnc2)c(C)n1-c1ccc(OCc2ccc(Cl)cc2)cc1
: