Target
DNA damage-inducible transcript 3 protein
Ligand
BDBM61626
Substrate
Meas. Tech.
CHOP dose-response primary assay
IC50
<160±n/a nM
Citation
 PubChem, PC CHOP dose-response primary assay PubChem Bioassay (2011)[AID] 
Target
Name:
DNA damage-inducible transcript 3 protein
Synonyms:
Chop DDIT3_MOUSE Gadd153
Type:
Enzyme Catalytic Domain
Mol. Mass.:
19175.17
Organism:
Mus musculus
Description:
gi_160707929
Residue:
168
  
Inhibitor
Name:
BDBM61626
Synonyms:
MLS000777252 N-(4-hydroxyphenyl)-4-[(5Z)-4-keto-5-(4-methylbenzylidene)-2-thioxo-thiazolidin-3-yl]butyramide N-(4-hydroxyphenyl)-4-[(5Z)-5-[(4-methylphenyl)methylidene]-4-oxo-2-sulfanylidene-1,3-thiazolidin-3-yl]butanamide SMR000413647 | cid_1346847
Type:
Small organic molecule
Emp. Form.:
C21H20N2O3S2
Mol. Mass.:
412.525
SMILES:
Cc1ccc(\C=C2/SC(=S)N(CCCC(=O)Nc3ccc(O)cc3)C2=O)cc1
: