Target
Orexin/Hypocretin receptor type 1
Ligand
BDBM79793
Substrate
Meas. Tech.
Fluorescence-based cell-based high throughput dose response assay for antagonists of the orexin 1 receptor (OX1R; HCRTR1)
IC50
1457±n/a nM
Citation
 PubChem, PC Fluorescence-based cell-based high throughput dose response assay for antagonists of the orexin 1 receptor (OX1R; HCRTR1) PubChem Bioassay (2011)[AID] 
Target
Name:
Orexin/Hypocretin receptor type 1
Synonyms:
HCRTR1 OX1R_HUMAN Orexin receptor type 1 (OR 1) Orexin receptor type 1 (OX1) Orexin receptor type 1 (OxR1) | Ox1r
Type:
Protein
Mol. Mass.:
47554.50
Organism:
Homo sapiens (Human)
Description:
O43613
Residue:
425
  
Inhibitor
Name:
BDBM79793
Synonyms:
3-Methyl-benzofuran-2-carboxylic acid (4-morpholin-4-yl-phenyl)-amide 3-methyl-N-(4-morpholinophenyl)coumarilamide MLS000035891 cid_647689
Type:
Small organic molecule
Emp. Form.:
C20H20N2O3
Mol. Mass.:
336.3844
SMILES:
Cc1c(oc2ccccc12)C(=O)Nc1ccc(cc1)N1CCOCC1
: