Target
Orexin/Hypocretin receptor type 1
Ligand
BDBM38923
Substrate
Meas. Tech.
Homogeneous Time Resolved Fluorescence (HTRF)-based cell-based high throughput dose response assay for antagonists of the orexin 1 receptor (OX1R; HCRTR1)
IC50
1976±n/a nM
Citation
 PubChem, PC Homogeneous Time Resolved Fluorescence (HTRF)-based cell-based high throughput dose response assay for antagonists of the orexin 1 receptor (OX1R; HCRTR1) PubChem Bioassay (2011)[AID] 
Target
Name:
Orexin/Hypocretin receptor type 1
Synonyms:
HCRTR1 OX1R_HUMAN Orexin receptor type 1 (OR 1) Orexin receptor type 1 (OX1) Orexin receptor type 1 (OxR1) | Ox1r
Type:
Protein
Mol. Mass.:
47554.50
Organism:
Homo sapiens (Human)
Description:
O43613
Residue:
425
  
Inhibitor
Name:
BDBM38923
Synonyms:
(2-oxidanylideneoxolan-3-yl) 5-(1,3-benzothiazol-2-yl)thiophene-2-carboxylate 5-(1,3-benzothiazol-2-yl)-2-thiophenecarboxylic acid (2-oxo-3-oxolanyl) ester MLS000096514 cid_2997660
Type:
Small organic molecule
Emp. Form.:
C16H11NO4S2
Mol. Mass.:
345.393
SMILES:
O=C(OC1CCOC1=O)c1ccc(s1)-c1nc2ccccc2s1
: