Target
Beta-2 adrenergic receptor
Ligand
BDBM86698
Substrate
Ki
>10000±n/a nM
Comments
PDSP_347
Citation
 Bylund, DBSnyder, SH Beta adrenergic receptor binding in membrane preparations from mammalian brain. Mol Pharmacol 12:568-80 (1976) Target
Name:
Beta-2 adrenergic receptor
Synonyms:
ADRB2 ADRB2_HUMAN Beta-2 adrenoceptor | Beta-2 adrenoreceptor
Type:
Mol. Mass.:
46461.69
Organism:
Homo sapiens (Human)
Description:
P07550
Residue:
413
  
Inhibitor
Name:
BDBM86698
Synonyms:
BENZTROPINE CHEMBL116590 | NSC_2344
Type:
Small organic molecule
Emp. Form.:
C21H25NO
Mol. Mass.:
307.4293
SMILES:
CN1C2CCC1CC(C2)OC(c1ccccc1)c1ccccc1
: