Target
Histamine H1 receptor
Ligand
BDBM81465
Substrate
Ki
13±n/a nM
Comments
PDSP_427
Citation
 Tran, VTChang, RSSnyder, SH Histamine H1 receptors identified in mammalian brain membranes with [3H]mepyramine. Proc Natl Acad Sci U S A 75:6290-4 (1978)  
Target
Name:
Histamine H1 receptor
Synonyms:
HISTAMINE H1 Hrh1
Type:
Enzyme Catalytic Domain
Mol. Mass.:
55716.35
Organism:
RAT
Description:
HISTAMINE H1 HRH1 RAT::P31390
Residue:
486
  
Inhibitor
Name:
BDBM81465
Synonyms:
 CAS_2444 | NSC_2444
Type:
Small organic molecule
Emp. Form.:
C17H20BrNO
Mol. Mass.:
334.251
SMILES:
CN(C)CCOC(c1ccccc1)c1ccc(Br)cc1
: