Target
HIV-1 protease
Ligand
BDBM81674
Substrate
Meas. Tech.
Inhibition Assay
Ki
110±0.0 nM
Citation
 Chellappan, SKiran Kumar Reddy, GSAli, ANalam, MNAnjum, SGCao, HKairys, VFernandes, MXAltman, MDTidor, BRana, TMSchiffer, CAGilson, MK Design of mutation-resistant HIV protease inhibitors with the substrate envelope hypothesis. Chem Biol Drug Des 69:298-313 (2007)  
Target
Name:
HIV-1 protease
Synonyms:
Type:
Protein
Mol. Mass.:
10653.94
Organism:
Human immunodeficiency virus
Description:
O90783
Residue:
98
  
Inhibitor
Name:
BDBM81674
Synonyms:
CARB-AD08
Type:
Small organic molecule
Emp. Form.:
C29H35N3O7S
Mol. Mass.:
569.669
SMILES:
COc1cccc(c1)S(=O)(=O)N(C[C@@H](O)[C@H](Cc1ccccc1)NC(=O)c1ccnc(OC)c1)CC1CCCO1
: