Target
HIV-1 protease
Ligand
BDBM81676
Substrate
Meas. Tech.
Inhibition Assay
Ki
540±0.0 nM
Citation
 Chellappan, SKiran Kumar Reddy, GSAli, ANalam, MNAnjum, SGCao, HKairys, VFernandes, MXAltman, MDTidor, BRana, TMSchiffer, CAGilson, MK Design of mutation-resistant HIV protease inhibitors with the substrate envelope hypothesis. Chem Biol Drug Des 69:298-313 (2007)  
Target
Name:
HIV-1 protease
Synonyms:
Type:
Protein
Mol. Mass.:
10653.94
Organism:
Human immunodeficiency virus
Description:
O90783
Residue:
98
  
Inhibitor
Name:
BDBM81676
Synonyms:
CARB-KB49
Type:
Small organic molecule
Emp. Form.:
C22H31N3O7S
Mol. Mass.:
481.562
SMILES:
CNC(=O)CCC(=O)N[C@@H](Cc1ccccc1)[C@H](O)CN(C[C@@H](C)O)S(=O)(=O)c1ccco1
: