Target
Tyrosine-protein kinase ABL1
Ligand
BDBM81734
Substrate
Meas. Tech.
Kinase Assay
pH
7.4±0
Temperature
298.15±0 K
IC50
20± 9 nM
Citation
 Zhou, TParillon, LLi, FWang, YKeats, JLamore, SXu, QShakespeare, WDalgarno, DZhu, X Crystal structure of the T315I mutant of AbI kinase. Chem Biol Drug Des 70:171-81 (2007)  
Target
Name:
Tyrosine-protein kinase ABL1
Synonyms:
ABL ABL1_HUMAN JTK7 Proto-oncogene tyrosine-protein kinase ABL1 Tyrosine-protein kinase ABL V-abl Abelson murine leukemia viral oncogene homolog 1 p150 | tyrosine-protein kinase ABL1 isoform a
Type:
Enzyme
Mol. Mass.:
122897.30
Organism:
Homo sapiens (Human)
Description:
P00519
Residue:
1130
  
Inhibitor
Name:
BDBM81734
Synonyms:
PPY-A
Type:
Small organic molecule
Emp. Form.:
C22H20N4O2
Mol. Mass.:
372.4198
SMILES:
COc1ccccc1-c1c[nH]c2ncc(cc12)-c1cncc(c1)C(=O)N(C)C
: