Target
Alpha-2B adrenergic receptor
Ligand
BDBM81444
Substrate
Ki
4.34±n/a nM
Comments
PDSP_1955
Citation
 Bylund, DBBlaxall, HSIversen, LJCaron, MGLefkowitz, RJLomasney, JW Pharmacological characteristics of alpha 2-adrenergic receptors: comparison of pharmacologically defined subtypes with subtypes identified by molecular cloning. Mol Pharmacol 42:1-5 (1992) Target
Name:
Alpha-2B adrenergic receptor
Synonyms:
ADA2B_HUMAN ADRA2L1 Adrenergic alpha2B Adrenergic receptor alpha Alpha-2 adrenergic receptor subtype C2 Alpha-2B adrenoreceptor | Alpha-2BAR
Type:
Enzyme
Mol. Mass.:
49964.20
Organism:
Homo sapiens (Human)
Description:
P18089
Residue:
450
  
Inhibitor
Name:
BDBM81444
Synonyms:
CAS_185453 WB 4101 | WB-4101
Type:
Small organic molecule
Emp. Form.:
C25H27NO5
Mol. Mass.:
421.4856
SMILES:
COc1cccc(OC)c1OCCNCC1Oc2ccccc2OC1c1ccccc1
: