Target
5-hydroxytryptamine receptor 1B
Ligand
BDBM50014406
Substrate
Ki
915±n/a nM
Comments
PDSP_154
Citation
 Weinshank, RLZgombick, JMMacchi, MJBranchek, TAHartig, PR Human serotonin 1D receptor is encoded by a subfamily of two distinct genes: 5-HT1D alpha and 5-HT1D beta. Proc Natl Acad Sci U S A 89:3630-4 (1992)  
Target
Name:
5-hydroxytryptamine receptor 1B
Synonyms:
5-HT-1B 5-HT1B 5HT1B_HUMAN HTR1DB Serotonin (5-HT) receptor Serotonin Receptor 1B
Type:
G Protein-Coupled Receptor (GPCR)
Mol. Mass.:
43579.17
Organism:
Homo sapiens (Human)
Description:
Receptor binding assays were performed using human clone stably expressed in CHO cells
Residue:
390
  
Inhibitor
Name:
BDBM50014406
Synonyms:
2-Me 5-HT 2-methyl-5-HT 3-(2-aminoethyl)-2-methyl-1H-indol-5-ol CHEMBL266591
Type:
Small organic molecule
Emp. Form.:
C11H14N2O
Mol. Mass.:
190.2417
SMILES:
Cc1[nH]c2ccc(O)cc2c1CCN
: